better output (more readable)

17 jobs for master in 4 minutes and 7 seconds (queued for 7 seconds)
latest
Status Name Job ID Coverage
  Build
passed gfortran-Debug #18295

00:01:42

passed gfortran-Release #18296

00:01:08

failed intel-Debug #18297
allowed to fail

00:00:59

failed intel-Release #18298
allowed to fail

00:01:11

 
  Static Analysis
passed black #18301

00:00:18

passed cmake-format #18306

00:00:16

passed cmake-lint #18307

00:00:15

failed cppcheck #18300
allowed to fail

00:00:27

failed cpplint #18299
allowed to fail

00:00:24

failed flake8 #18303
allowed to fail

00:00:14

passed isort #18302

00:00:17

passed mypy #18304

00:00:30

failed pylint #18305
allowed to fail

00:01:00

passed shell check #18308

00:00:14

passed shfmt #18309

00:00:13

 
  Run
passed pytest_data #18310

00:00:47

 
  Test
passed pymcac_tests #18311

00:01:37

79.0%
 
Name Stage Failure
failed
intel-Release Build
collect2: error: ld returned 1 exit status
src/CMakeFiles/MCAC.dir/build.make:535: recipe for target '../bin/Release/MCAC' failed
make[2]: *** [../bin/Release/MCAC] Error 1
CMakeFiles/Makefile2:261: recipe for target 'src/CMakeFiles/MCAC.dir/all' failed
make[1]: *** [src/CMakeFiles/MCAC.dir/all] Error 2
Makefile:90: recipe for target 'all' failed
make: *** [all] Error 2
Cleaning up project directory and file based variables
ERROR: Job failed: exit code 1

failed
pylint Static Analysis
    "discretize",
"inertia",
"volume_surface", (duplicate-code)

-----------------------------------
Your code has been rated at 7.82/10

Cleaning up project directory and file based variables
ERROR: Job failed: exit code 1

failed
intel-Debug Build
collect2: error: ld returned 1 exit status
src/CMakeFiles/MCAC.dir/build.make:535: recipe for target '../bin/Debug/MCAC' failed
make[2]: *** [../bin/Debug/MCAC] Error 1
make[1]: *** [src/CMakeFiles/MCAC.dir/all] Error 2
CMakeFiles/Makefile2:261: recipe for target 'src/CMakeFiles/MCAC.dir/all' failed
make: *** [all] Error 2
Makefile:90: recipe for target 'all' failed
Cleaning up project directory and file based variables
ERROR: Job failed: exit code 1

failed
cppcheck Static Analysis
$ echo "dockerfile_version=${dockerfile_version}"
dockerfile_version=d270a39
$ pip install -U cppcheck
ERROR: Could not find a version that satisfies the requirement cppcheck (from versions: none)
ERROR: No matching distribution found for cppcheck
WARNING: You are using pip version 21.1.2; however, version 21.3.1 is available.
You should consider upgrading via the '/usr/local/bin/python -m pip install --upgrade pip' command.
Cleaning up project directory and file based variables
ERROR: Job failed: exit code 1

failed
cpplint Static Analysis
Done processing src/spheres/sphere_intersection.cpp
Done processing src/spheres/sphere_list.cpp
Done processing src/spheres/sphere_list_storage.cpp
Done processing src/spheres/sphere_storage.cpp
Done processing src/tools/tools.cpp
Done processing src/verlet/verlet.cpp
Total errors found: 1193
Cleaning up project directory and file based variables
ERROR: Job failed: exit code 1

failed
flake8 Static Analysis
$ pflake8
./pymcac/tests/test_groupby.py:73:1: E266 too many leading '#' for block comment
######## using dataframes #########
^
./pymcac/tests/test_groupby.py:355:1: E266 too many leading '#' for block comment
############ manually ############
^
Cleaning up project directory and file based variables
ERROR: Job failed: exit code 1